Target
Aurora kinase B
Ligand
BDBM26300
Substrate
Biotinylated Peptide Substrate
Meas. Tech.
Aurora B Kinase Inhibition Assay
Temperature
298.15±n/a K
Ki
<1±n/a nM
Comments
extracted
Citation
 Mortlock, AAFoote, KMHeron, NMJung, FHPasquet, GLohmann, JJWarin, NRenaud, FDe Savi, CRoberts, NJJohnson, TDousson, CBHill, GBPerkins, DHatter, GWilkinson, RWWedge, SRHeaton, SPOdedra, RKeen, NJCrafter, CBrown, EThompson, KBrightwell, SKhatri, LBrady, MCKearney, SMcKillop, DRhead, SParry, TGreen, S Discovery, synthesis, and in vivo activity of a new class of pyrazoloquinazolines as selective inhibitors of aurora B kinase. J Med Chem 50:2213-24 (2007)  
Target
Name:
Aurora kinase B
Synonyms:
AIK2 AIM1 ARK2 AURKB_HUMAN Aurora B-INCENP Aurora kinase B (AURKB) STK-1 STK12 Serine/threonine-protein kinase aurora B
Type:
Protein
Mol. Mass.:
39327.72
Organism:
Homo sapiens (Human)
Description:
Q96GD4
Residue:
344
  
Inhibitor
Name:
BDBM26300
Synonyms:
2-{3-[(7-{3-[ethyl(2-hydroxyethyl)amino]propoxy}quinazolin-4-yl)amino]-1H-pyrazol-5-yl}-N-(3-fluorophenyl)acetamide cid_16007391 | pyrazoloquinazoline deriv., 34
Type:
Small organic molecule
Emp. Form.:
C26H30FN7O3
Mol. Mass.:
507.5599
SMILES:
CCN(CCO)CCCOc1ccc2c(Nc3cc(CC(=O)Nc4cccc(F)c4)n[nH]3)ncnc2c1
:
Substrate
Name:
Biotinylated Peptide Substrate
Synonyms:
Type:
Peptide
Mol. Mass.:
2374.22
Organism:
Description:
Residue:
20