Target
Aurora kinase A
Ligand
BDBM26305
Substrate
Biotinylated Peptide Substrate
Meas. Tech.
Aurora A Kinase Inhibition Assay
pH
7.5±n/a
Temperature
295.15±n/a K
Ki
1300±n/a nM
Citation
 Foote, KMMortlock, AAHeron, NMJung, FHHill, GBPasquet, GBrady, MCGreen, SHeaton, SPKearney, SKeen, NJOdedra, RWedge, SRWilkinson, RW Synthesis and SAR of 1-acetanilide-4-aminopyrazole-substituted quinazolines: selective inhibitors of Aurora B kinase with potent anti-tumor activity. Bioorg Med Chem Lett 18:1904-9 (2008)  
Target
Name:
Aurora kinase A
Synonyms:
AIK ARK1 AURKA AYK1 Aurora kinase A (AURA) Aurora kinase A (Aurora A) Aurora-related kinase 1 BTAK Breast-tumor-amplified kinase STK15 Serine/threonine kinase 15 Serine/threonine-protein kinase aurora A hARK1
Type:
Serine/threonine-protein kinase
Mol. Mass.:
45830.98
Organism:
Homo sapiens (Human)
Description:
O14965
Residue:
403
  
Inhibitor
Name:
BDBM26305
Synonyms:
4-aminopyrazole quinazoline, 5 | N-(3-fluorophenyl)-2-{4-[(7-{3-[(2R)-2-(hydroxymethyl)pyrrolidin-1-yl]propoxy}-6-methoxyquinazolin-4-yl)amino]-1H-pyrazol-1-yl}acetamide
Type:
Small organic molecule
Emp. Form.:
C28H32FN7O4
Mol. Mass.:
549.5966
SMILES:
COc1cc2c(Nc3cnn(CC(=O)Nc4cccc(F)c4)c3)ncnc2cc1OCCCN1CCC[C@@H]1CO
:
Substrate
Name:
Biotinylated Peptide Substrate
Synonyms:
Type:
Peptide
Mol. Mass.:
2374.22
Organism:
Description:
Residue:
20