Target
Glutaminase kidney isoform, mitochondrial
Ligand
BDBM108983
Substrate
Meas. Tech.
Recombinant Enzyme Assay
IC50
5.00±n/a nM
Citation
 Li, JChen, LGoyal, BLaidig, GStanton, TFSjogren, EB Heterocyclic inhibitors of glutaminase US Patent  US9938267 Publication Date 4/10/2018 
Target
Name:
Glutaminase kidney isoform, mitochondrial
Synonyms:
GLS GLSK_HUMAN K-glutaminase L-glutamine amidohydrolase
Type:
Protein
Mol. Mass.:
73471.89
Organism:
Homo sapiens (Human)
Description:
O94925
Residue:
669
  
Inhibitor
Name:
BDBM108983
Synonyms:
US8604016, 565 | US9938267, Cmpd ID 565
Type:
Small organic molecule
Emp. Form.:
C26H24Cl2N6O2S
Mol. Mass.:
555.479
SMILES:
Clc1ccccc1CC(=O)Nc1nnc(CCCCc2ccc(NC(=O)Cc3ccccc3Cl)nn2)s1
: