Target
Vascular endothelial growth factor receptor 2
Ligand
BDBM26471
Substrate
biotinylated VEGFR peptide substrate
Meas. Tech.
Homogeneous Time-Resolved Fluorescence (HTRF) Enzyme Assay
pH
7.5±n/a
Temperature
295.15±n/a K
IC50
7.6±n/a nM
Citation
 Harris, PABoloor, ACheung, MKumar, RCrosby, RMDavis-Ward, RGEpperly, AHHinkle, KWHunter, RNJohnson, JHKnick, VBLaudeman, CPLuttrell, DKMook, RANolte, RTRudolph, SKSzewczyk, JRTruesdale, ATVeal, JMWang, LStafford, JA Discovery of 5-[[4-[(2,3-dimethyl-2H-indazol-6-yl)methylamino]-2-pyrimidinyl]amino]-2-methyl-benzenesulfonamide (Pazopanib), a novel and potent vascular endothelial growth factor receptor inhibitor. J Med Chem 51:4632-40 (2008)  
Target
Name:
Vascular endothelial growth factor receptor 2
Synonyms:
CD_antigen=CD309 Fetal liver kinase 1 (FLK-1) KDR Protein-tyrosine kinase receptor Flk-1 VEGFR-2 VEGFR2 Vascular Endothelial Growth Factor Receptor Kinase 2 Vascular endothelial growth factor receptor 2 (KDR) Vascular endothelial growth factor receptor 2 (VEGFR2) Vascular endothelial growth factor receptor-2 (VEGFR-2)
Type:
Receptor Tyrosine Kinase
Mol. Mass.:
151510.97
Organism:
Homo sapiens (Human)
Description:
P35968
Residue:
1356
  
Inhibitor
Name:
BDBM26471
Synonyms:
3-({4-[methyl(2-methyl-2H-indazol-6-yl)amino]pyrimidin-2-yl}amino)benzene-1-sulfonamide | 3-aminobenzene sulfonamide, 12e
Type:
Small organic molecule
Emp. Form.:
C19H19N7O2S
Mol. Mass.:
409.465
SMILES:
CN(c1ccc2cn(C)nc2c1)c1ccnc(Nc2cccc(c2)S(N)(=O)=O)n1
:
Substrate
Name:
biotinylated VEGFR peptide substrate
Synonyms:
Type:
Peptide
Mol. Mass.:
3433.86
Organism:
Description:
Residue:
28