Target
Serine/threonine-protein kinase PLK1
Ligand
BDBM26514
Substrate
Ser/Thr 16 Peptide
Meas. Tech.
Enzymatic Activity Assay
pH
7.5±n/a
Temperature
295.15±n/a K
IC50
5.0±2.4 nM
Citation
 Kothe, MKohls, DLow, SColi, RRennie, GRFeru, FKuhn, CDing, YH Selectivity-determining residues in Plk1. Chem Biol Drug Des 70:540-6 (2007)  
Target
Name:
Serine/threonine-protein kinase PLK1
Synonyms:
PLK PLK1 Polo-like kinase 1 (PlK1) STPK13 Serine/threonine-protein kinase 13 | polo-like kinase
Type:
Serine/threonine-protein kinase
Mol. Mass.:
68277.16
Organism:
Homo sapiens (Human)
Description:
P53350
Residue:
603
  
Inhibitor
Name:
BDBM26514
Synonyms:
4-{[(7R)-8-cyclopentyl-7-ethyl-5-methyl-6-oxo-5,6,7,8-tetrahydropteridin-2-yl]amino}-N-(1-methylpiperidin-4-yl)benzamide | BI 2536 analogue, 1b
Type:
Small organic molecule
Emp. Form.:
C27H37N7O2
Mol. Mass.:
491.6284
SMILES:
CC[C@H]1N(C2CCCC2)c2nc(Nc3ccc(cc3)C(=O)NC3CCN(C)CC3)ncc2N(C)C1=O
:
Substrate
Name:
Ser/Thr 16 Peptide
Synonyms:
Type:
Peptide
Mol. Mass.:
358.43
Organism:
Description:
SelectScreen Biochemical Kinase Profiling Service (Invitrogen Corporation, Carlsbad, CA, USA).
Residue:
3
NA