Target
Disintegrin and metalloproteinase domain-containing protein 17 [215-477,S266A,N452Q]
Ligand
BDBM26549
Substrate
TACE Substrate Peptide
Meas. Tech.
TACE Inhibition Assay
pH
7.5±n/a
Temperature
295.15±n/a K
Ki
5±n/a nM
Citation
 Govinda Rao, BBandarage, UKWang, TCome, JHPerola, EWei, YTian, SKSaunders, JO Novel thiol-based TACE inhibitors: rational design, synthesis, and SAR of thiol-containing aryl sulfonamides. Bioorg Med Chem Lett 17:2250-3 (2007)  
Target
Name:
Disintegrin and metalloproteinase domain-containing protein 17 [215-477,S266A,N452Q]
Synonyms:
A disintegrin and metalloproteinase domain 17 ADAM 17 CD156b antigen Snake venom-like protease TNF-alpha-Converting Enzyme
Type:
Single-pass type I membrane protein; metalloprotease
Mol. Mass.:
29695.98
Organism:
Homo sapiens (Human)
Description:
The catalytic domain of recombinant human TNF-converting enzyme (residues 215-477) with two mutations (S266A and N452Q) and a 6xHis was purified from the baculovirus/Hi5 cells expression system.
Residue:
263
  
Inhibitor
Name:
BDBM26549
Synonyms:
(3R)-1-{[4-(but-2-yn-1-ylamino)benzene]sulfonyl}pyrrolidine-3-thiol | thiol-arylsulfonamide, 16b
Type:
Small organic molecule
Emp. Form.:
C14H18N2O2S2
Mol. Mass.:
310.435
SMILES:
CC#CCNc1ccc(cc1)S(=O)(=O)N1CC[C@@H](S)C1
:
Substrate
Name:
TACE Substrate Peptide
Synonyms:
Bachem M-2155 | DABCYL-TNF-alpha-EDANS (-4 to +6) (human)
Type:
Internally quenched peptide
Mol. Mass.:
4104.44
Organism:
Description:
Residue:
39