Target
Disintegrin and metalloproteinase domain-containing protein 17 [215-477,S266A,N452Q]
Ligand
BDBM26550
Substrate
TACE Substrate Peptide
Meas. Tech.
TACE Inhibition Assay
pH
7.5±n/a
Temperature
295.15±n/a K
Ki
10±n/a nM
Citation
 Bandarage, UKWang, TCome, JHPerola, EWei, YRao, BG Novel thiol-based TACE inhibitors. Part 2: Rational design, synthesis, and SAR of thiol-containing aryl sulfones. Bioorg Med Chem Lett 18:44-8 (2008)  
Target
Name:
Disintegrin and metalloproteinase domain-containing protein 17 [215-477,S266A,N452Q]
Synonyms:
A disintegrin and metalloproteinase domain 17 ADAM 17 CD156b antigen Snake venom-like protease TNF-alpha-Converting Enzyme
Type:
Single-pass type I membrane protein; metalloprotease
Mol. Mass.:
29695.98
Organism:
Homo sapiens (Human)
Description:
The catalytic domain of recombinant human TNF-converting enzyme (residues 215-477) with two mutations (S266A and N452Q) and a 6xHis was purified from the baculovirus/Hi5 cells expression system.
Residue:
263
  
Inhibitor
Name:
BDBM26550
Synonyms:
2-{[4-(but-2-yn-1-yloxy)benzene](methyl)sulfonamido}-N-hydroxyacetamide CHEMBL321556 | butynyloxy containing compound, 1
Type:
Small organic molecule
Emp. Form.:
C13H16N2O5S
Mol. Mass.:
312.342
SMILES:
CC#CCOc1ccc(cc1)S(=O)(=O)N(C)CC(=O)NO
:
Substrate
Name:
TACE Substrate Peptide
Synonyms:
Bachem M-2155 | DABCYL-TNF-alpha-EDANS (-4 to +6) (human)
Type:
Internally quenched peptide
Mol. Mass.:
4104.44
Organism:
Description:
Residue:
39