Target
72 kDa type IV collagenase
Ligand
BDBM26543
Substrate
BDBM23499
Meas. Tech.
MMP Inhibition Assay
pH
7.4±n/a
Temperature
295.15±n/a K
Ki
5000±n/a nM
Citation
 Bandarage, UKWang, TCome, JHPerola, EWei, YRao, BG Novel thiol-based TACE inhibitors. Part 2: Rational design, synthesis, and SAR of thiol-containing aryl sulfones. Bioorg Med Chem Lett 18:44-8 (2008)  
Target
Name:
72 kDa type IV collagenase
Synonyms:
72 kDa gelatinase CLG4A Gelatinase A (MMP-2) MMP2_HUMAN Matrix metalloproteinase-2 (MMP 2) Matrix metalloproteinases 2 (MMP-2) | TBE-1
Type:
Enzyme
Mol. Mass.:
73870.36
Organism:
Homo sapiens (Human)
Description:
P08253
Residue:
660
  
Inhibitor
Name:
BDBM26543
Synonyms:
(3R)-1-{[4-(but-2-yn-1-yloxy)benzene]sulfonyl}pyrrolidine-3-thiol thiol-arylsulfonamide, 4b
Type:
Small organic molecule
Emp. Form.:
C14H17NO3S2
Mol. Mass.:
311.42
SMILES:
CC#CCOc1ccc(cc1)S(=O)(=O)N1CC[C@@H](S)C1
:
Substrate
Name:
BDBM23499
Synonyms:
7-methoxycoumarin-PQGL-(3-[2,4-dinitrophenyl]-L-2,3-diaminopropionyl)-AR-OH | Wammp-5
Type:
Fluorogenic substrate
Emp. Form.:
Mol. Mass.:
SMILES:
: