Target
Matrilysin
Ligand
BDBM26550
Substrate
BDBM23499
Meas. Tech.
MMP Inhibition Assay
pH
7.4±n/a
Temperature
295.15±n/a K
Ki
3400±n/a nM
Citation
 Bandarage, UKWang, TCome, JHPerola, EWei, YRao, BG Novel thiol-based TACE inhibitors. Part 2: Rational design, synthesis, and SAR of thiol-containing aryl sulfones. Bioorg Med Chem Lett 18:44-8 (2008)  
Target
Name:
Matrilysin
Synonyms:
MMP7 MPSL1 Matrix metalloproteinase-7 (MMP-7) PUMP1
Type:
Enzyme
Mol. Mass.:
29681.54
Organism:
Homo sapiens (Human)
Description:
P09237
Residue:
267
  
Inhibitor
Name:
BDBM26550
Synonyms:
2-{[4-(but-2-yn-1-yloxy)benzene](methyl)sulfonamido}-N-hydroxyacetamide CHEMBL321556 | butynyloxy containing compound, 1
Type:
Small organic molecule
Emp. Form.:
C13H16N2O5S
Mol. Mass.:
312.342
SMILES:
CC#CCOc1ccc(cc1)S(=O)(=O)N(C)CC(=O)NO
:
Substrate
Name:
BDBM23499
Synonyms:
7-methoxycoumarin-PQGL-(3-[2,4-dinitrophenyl]-L-2,3-diaminopropionyl)-AR-OH | Wammp-5
Type:
Fluorogenic substrate
Emp. Form.:
Mol. Mass.:
SMILES:
: