Target
DNA-(apurinic or apyrimidinic site) endonuclease
Ligand
BDBM26580
Substrate
DNA Substrate
Meas. Tech.
APE1 Inhibition Assay
pH
7.5±n/a
Temperature
303.15±n/a K
IC50
4000±1000 nM
Citation
 Zawahir, ZDayam, RDeng, JPereira, CNeamati, N Pharmacophore guided discovery of small-molecule human apurinic/apyrimidinic endonuclease 1 inhibitors. J Med Chem 52:20-32 (2009)  
Target
Name:
DNA-(apurinic or apyrimidinic site) endonuclease
Synonyms:
APE APEX APEX1_HUMAN Apurinic-apyrimidinic endonuclease 1 (APE-1) DNA-(apurinic or apyrimidinic site) lyase REF1
Type:
Protein
Mol. Mass.:
35560.12
Organism:
Homo sapiens (Human)
Description:
P27695
Residue:
318
  
Inhibitor
Name:
BDBM26580
Synonyms:
4-({4-[(4-carboxyphenyl)sulfanyl]benzene}sulfonyl)benzene-1,2-dicarboxylic acid | H1-A1NI2, 5
Type:
Small organic molecule
Emp. Form.:
C21H14O8S2
Mol. Mass.:
458.461
SMILES:
OC(=O)c1ccc(Sc2ccc(cc2)S(=O)(=O)c2ccc(C(O)=O)c(c2)C(O)=O)cc1
:
Substrate
Name:
DNA Substrate
Synonyms:
Annealed double-stranded oligonucleotide with an abasic site
Type:
Radiolabeled substrate
Mol. Mass.:
2306.64
Organism:
Description:
The top strand is 5-ATTTCACCGGTACG(F)TCTAGAATCC-3 containing the tetrahydrofuran synthetic abasic residue (F). It is radiolabeled with gamma-32P.
Residue:
26