Target
Serine/threonine-protein kinase pim-1
Ligand
BDBM26658
Substrate
GST-BAD
Meas. Tech.
Solid-Phase ELISA Kinase Assay
pH
7±n/a
Temperature
303.15±n/a K
IC50
2700±n/a nM
Citation
 Holder, SZemskova, MZhang, CTabrizizad, MBremer, RNeidigh, JWLilly, MB Characterization of a potent and selective small-molecule inhibitor of the PIM1 kinase. Mol Cancer Ther 6:163-72 (2007)  
Target
Name:
Serine/threonine-protein kinase pim-1
Synonyms:
PIM-1 Kinase PIM1_HUMAN Serine/threonine-protein kinase (PIM1) Serine/threonine-protein kinase PIM1 | Serine/threonine-protein kinase pim-1 (PIM1)
Type:
Protein
Mol. Mass.:
35681.82
Organism:
Homo sapiens (Human)
Description:
P11309
Residue:
313
  
Inhibitor
Name:
BDBM26658
Synonyms:
2-(2,4-dihydroxyphenyl)-3,5,7-trihydroxy-1-benzopyran-4-one 2-(2,4-dihydroxyphenyl)-3,5,7-trihydroxy-chromone 2-[2,4-bis(oxidanyl)phenyl]-3,5,7-tris(oxidanyl)chromen-4-one MLS000069618 Morin (5) SMR000058259 morin
Type:
Flavonoid
Emp. Form.:
C15H10O7
Mol. Mass.:
302.2357
SMILES:
Oc1ccc(c(O)c1)-c1oc2cc(O)cc(O)c2c(=O)c1O
:
Substrate
Name:
Bcl2-associated agonist of cell death
Synonyms:
BAD_MOUSE Bbc6 GST-BAD
Type:
Other Protein Type
Mol. Mass.:
22084.58
Organism:
Mus musculus (mouse)
Description:
Residue:
204