Target
Fatty-acid amide hydrolase 1
Ligand
BDBM23120
Substrate
BDBM23028
Meas. Tech.
FAAH Inhibition Assay (15 min Preincubation)
pH
7.4±n/a
Temperature
303.15±n/a K
IC50
208±n/a nM
Citation
 Ahn, KJohnson, DSFitzgerald, LRLiimatta, MArendse, AStevenson, TLund, ETNugent, RANomanbhoy, TKAlexander, JPCravatt, BF Novel mechanistic class of fatty acid amide hydrolase inhibitors with remarkable selectivity. Biochemistry 46:13019-30 (2007)  
Target
Name:
Fatty-acid amide hydrolase 1
Synonyms:
Anandamide amidohydrolase FAAH FAAH1_HUMAN Fatty-acid amide hydrolase (FAAH) Oleamide hydrolase 1
Type:
Protein
Mol. Mass.:
63071.19
Organism:
Homo sapiens (Human)
Description:
O00519
Residue:
579
  
Inhibitor
Name:
BDBM23120
Synonyms:
7-phenyl-1-[5-(pyridin-2-yl)-1,3-oxazol-2-yl]heptan-1-one OL-135
Type:
Small organic molecule
Emp. Form.:
C21H22N2O2
Mol. Mass.:
334.4116
SMILES:
O=C(CCCCCCc1ccccc1)c1ncc(o1)-c1ccccn1
:
Substrate
Name:
BDBM23028
Synonyms:
(9Z)-octadec-9-enamide CHEMBL15927 Oleic acid amide | Oleylamide
Type:
Emp. Form.:
C18H35NO
Mol. Mass.:
281.4766
SMILES:
CCCCCCCC\C=C/CCCCCCCC(N)=O
: