Target
Beta-secretase 1
Ligand
BDBM26781
Substrate
Fluorescent Substrate
Meas. Tech.
Enzyme Inhibition Assay
pH
4.5±n/a
Temperature
295.15±n/a K
IC50
8±n/a nM
Citation
 Beswick, PCharrier, NClarke, BDemont, EDingwall, CDunsdon, RFaller, AGleave, RHawkins, JHussain, IJohnson, CNMacPherson, DMaile, GMatico, RMilner, PMosley, JNaylor, AO'Brien, ARedshaw, SRiddell, DRowland, PSkidmore, JSoleil, VSmith, KJStanway, SStemp, GStuart, ASweitzer, STheobald, PVesey, DWalter, DSWard, JWayne, G BACE-1 inhibitors part 3: identification of hydroxy ethylamines (HEAs) with nanomolar potency in cells. Bioorg Med Chem Lett 18:1022-6 (2008)  
Target
Name:
Beta-secretase 1
Synonyms:
ASP2 Aspartyl protease 2 BACE1 Beta-secretase (BACE) Beta-secretase 1 (BACE 1) Beta-secretase 1 (BACE1) Beta-site amyloid precursor protein cleaving enzyme 1 Memapsin-2 beta-Secretase (BACE-1) | beta-Secretase (BACE1)
Type:
Protein
Mol. Mass.:
55755.10
Organism:
Homo sapiens (Human)
Description:
P56817
Residue:
501
  
Inhibitor
Name:
BDBM26781
Synonyms:
3-(1,1-dioxo-1,2-thiazinan-2-yl)-5-(ethylamino)-N-[(2S,3R)-3-hydroxy-4-{[(3-methoxyphenyl)methyl]amino}-1-phenylbutan-2-yl]benzamide | hydroxy ethylamine (HEA), 16
Type:
Small organic molecule
Emp. Form.:
C31H40N4O5S
Mol. Mass.:
580.738
SMILES:
CCNc1cc(cc(c1)C(=O)N[C@@H](Cc1ccccc1)[C@H](O)CNCc1cccc(OC)c1)N1CCCCS1(=O)=O
:
Substrate
Name:
Fluorescent Substrate
Synonyms:
Type:
Peptide
Mol. Mass.:
2030.30
Organism:
Description:
Residue:
18
FAMSEVNLDAEFKTAMRA