Target
Beta-secretase 2
Ligand
BDBM26774
Substrate
Fluorescent Substrate
Meas. Tech.
Enzyme Inhibition Assay
IC50
1450±n/a nM
Citation
 Beswick, PCharrier, NClarke, BDemont, EDingwall, CDunsdon, RFaller, AGleave, RHawkins, JHussain, IJohnson, CNMacPherson, DMaile, GMatico, RMilner, PMosley, JNaylor, AO'Brien, ARedshaw, SRiddell, DRowland, PSkidmore, JSoleil, VSmith, KJStanway, SStemp, GStuart, ASweitzer, STheobald, PVesey, DWalter, DSWard, JWayne, G BACE-1 inhibitors part 3: identification of hydroxy ethylamines (HEAs) with nanomolar potency in cells. Bioorg Med Chem Lett 18:1022-6 (2008)  
Target
Name:
Beta-secretase 2
Synonyms:
AEPLC ASP1 Asp 1 Aspartyl protease 1 BACE2_HUMAN Beta-secretase (BACE) Beta-secretase 2 (BACE-2) Beta-site APP-cleaving enzyme 2 Memapsin-1 beta-Secretase (BACE-2)
Type:
Protein
Mol. Mass.:
56171.20
Organism:
Homo sapiens (Human)
Description:
Q9Y5Z0
Residue:
518
  
Inhibitor
Name:
BDBM26774
Synonyms:
3-(1,1-dioxo-1,2-thiazinan-2-yl)-N-[(2S,3R)-3-hydroxy-1-phenyl-4-({[3-(trifluoromethyl)phenyl]methyl}amino)butan-2-yl]-5-propylbenzamide | hydroxy ethylamine (HEA), 8
Type:
Small organic molecule
Emp. Form.:
C32H38F3N3O4S
Mol. Mass.:
617.722
SMILES:
CCCc1cc(cc(c1)C(=O)N[C@@H](Cc1ccccc1)[C@H](O)CNCc1cccc(c1)C(F)(F)F)N1CCCCS1(=O)=O
:
Substrate
Name:
Fluorescent Substrate
Synonyms:
Type:
Peptide
Mol. Mass.:
2030.30
Organism:
Description:
Residue:
18
FAMSEVNLDAEFKTAMRA