Target
C-C motif chemokine 4
Ligand
BDBM65497
Substrate
Meas. Tech.
cytomteric bead array (CBA) assay
Temperature
310.15±n/a K
IC50
>10000±n/a nM
Comments
extracted
Citation
 Gandhi, ADimartino, JChopra, R Methods for the treatment of locally advanced breast cancer US Patent  US9694015 Publication Date 7/4/2017 
Target
Name:
C-C motif chemokine 4
Synonyms:
ACT-2 CCL4_HUMAN HC21 LAG1 MIP-1-beta Macrophage inflammatory protein 1-beta Protein H400 SIS-gamma T-cell activation protein 2
Type:
Protein
Mol. Mass.:
10210.74
Organism:
Homo sapiens (Human)
Description:
P13236
Residue:
92
  
Inhibitor
Name:
BDBM65497
Synonyms:
CC-220 (Compound 6) | US9694015, 6.4S
Type:
Small organic molecule
Emp. Form.:
C25H27N3O5
Mol. Mass.:
449.499
SMILES:
O=C1N(Cc2c1cccc2OCc1ccc(CN2CCOCC2)cc1)[C@H]1CCC(=O)NC1=O
: