Target
Probable G-protein coupled receptor 139
Ligand
BDBM263511
Substrate
Meas. Tech.
Competition Binding
pH
7.4±n/a
Temperature
277.15±n/a K
Ki
183±n/a nM
Comments
extracted
Citation
 Hitchcock, SLam, BMonenschein, HReichard, H 4-oxo-3,4-dihydro-1,2,3-benzotriazine modulators of GPR139 US Patent  US9556130 Publication Date 1/31/2017 
Target
Name:
Probable G-protein coupled receptor 139
Synonyms:
G(q)-coupled orphan receptor GPRg1 G-protein-coupled receptor PGR3 GPR139 GPRG1 Probable G-protein coupled receptor 139
Type:
PROTEIN
Mol. Mass.:
40700.34
Organism:
Homo sapiens (Human)
Description:
ChEMBL_109920
Residue:
353
  
Inhibitor
Name:
BDBM263511
Synonyms:
(s)-2-(4-oxobenzo[d][1,2,3]triazin-3(4h)-yl)-n-(1-(4-(trifluoromethoxy)phenyl)propyl)acetamide US11173161, EX 86 | US9556130, test 86
Type:
Small organic molecule
Emp. Form.:
C19H17F3N4O3
Mol. Mass.:
406.3585
SMILES:
CC[C@H](NC(=O)Cn1nnc2ccccc2c1=O)c1ccc(OC(F)(F)F)cc1
: