Target
Tyrosine-protein kinase BTK
Ligand
BDBM263552
Substrate
Meas. Tech.
TR-FRET (Time Resolved FRET) Assay
pH
7.15±n/a
IC50
23.0±0 nM
Comments
extracted
Citation
 Lopez-Tapia, FJKong, NSo, SLou, YDominique, R Inhibitors of bruton's tyrosine kinase US Patent  US9556150 Publication Date 1/31/2017 
Target
Name:
Tyrosine-protein kinase BTK
Synonyms:
AGMX1 Agammaglobulinaemia tyrosine kinase B cell progenitor kinase BPK BTK_HUMAN Tyrosine Kinase BTK Tyrosine-protein kinase BTK (BTK)
Type:
Enzyme
Mol. Mass.:
76289.95
Organism:
Homo sapiens (Human)
Description:
Q06187
Residue:
659
  
Inhibitor
Name:
BDBM263552
Synonyms:
2-{5-amino-1-[4-(3-cyano- phenoxy)-2-methyl-phenyl]-1h- pyrazole-4-carbonyl}-1h- benzoimidazole-5-carboxylic acid (2-methoxy-ethyl)-amide | US9556150, i-40
Type:
Small organic molecule
Emp. Form.:
C29H25N7O4
Mol. Mass.:
535.5533
SMILES:
COCCNC(=O)c1ccc2[nH]c(nc2c1)C(=O)c1cnn(c1N)-c1ccc(Oc2cccc(c2)C#N)cc1C
: