Target
Aurora kinase B
Ligand
BDBM13534
Substrate
Biotinylated Cross-tide Substrate
Meas. Tech.
Aurora Kinase Assay
pH
8.5±n/a
Temperature
295.15±n/a K
IC50
17±n/a nM
Citation
 Howard, SBerdini, VBoulstridge, JACarr, MGCross, DMCurry, JDevine, LAEarly, TRFazal, LGill, ALHeathcote, MMaman, SMatthews, JEMcMenamin, RLNavarro, EFO'Brien, MAO'Reilly, MRees, DCReule, MTisi, DWilliams, GVinković, MWyatt, PG Fragment-based discovery of the pyrazol-4-yl urea (AT9283), a multitargeted kinase inhibitor with potent aurora kinase activity. J Med Chem 52:379-88 (2009)  
Target
Name:
Aurora kinase B
Synonyms:
AIK2 AIM1 ARK2 AURKB_HUMAN Aurora B-INCENP Aurora kinase B (AURKB) STK-1 STK12 Serine/threonine-protein kinase aurora B
Type:
Protein
Mol. Mass.:
39327.72
Organism:
Homo sapiens (Human)
Description:
Q96GD4
Residue:
344
  
Inhibitor
Name:
BDBM13534
Synonyms:
CHEMBL572878 N-[4-[[4-(4-methylpiperazino)-6-[(5-methyl-1H-pyrazol-3-yl)amino]pyrimidin-2-yl]thio]phenyl]cyclopropanecarboxamide VX680 | cyclopropane carboxylic acid {4-[4-(4-methyl-piperazin-1-yl)-6-(5-methyl-2H-pyrazol-3-ylamino)-pyrimidin-2ylsulphanyl]-phenyl}-amide
Type:
Small organic molecule
Emp. Form.:
C23H28N8OS
Mol. Mass.:
464.586
SMILES:
CN1CCN(CC1)c1cc(Nc2cc(C)n[nH]2)nc(Sc2ccc(NC(=O)C3CC3)cc2)n1
:
Substrate
Name:
Biotinylated Cross-tide Substrate
Synonyms:
Type:
Peptide
Mol. Mass.:
2578.93
Organism:
Description:
Residue:
24