Target
Histamine H3 receptor
Ligand
BDBM27211
Substrate
BDBM22530
Meas. Tech.
Radioligand Binding Assay
pH
7.4±n/a
Temperature
298.15±n/a K
Ki
1.62±n/a nM
Citation
 Zhao, CSun, MBennani, YLGopalakrishnan, SMWitte, DGMiller, TRKrueger, KMBrowman, KEThiffault, CWetter, JMarsh, KCHancock, AAEsbenshade, TACowart, MD The alkaloid conessine and analogues as potent histamine H3 receptor antagonists. J Med Chem 51:5423-30 (2008)  
Target
Name:
Histamine H3 receptor
Synonyms:
G-protein coupled receptor 97 HH3R HRH3 Histamine H3 receptor (H3) Histamine receptor (H3 and H4)
Type:
G Protein-Coupled Receptor (GPCR)
Mol. Mass.:
48691.47
Organism:
Homo sapiens (Human)
Description:
Binding assays were using CHO cells stably expressing hH3R receptors.
Residue:
445
  
Inhibitor
Name:
BDBM27211
Synonyms:
(2S)-2-acetamido-N,4-dimethyl-N-[(1R,2S,5S,6S,9R,12S,13R,16S)-6,7,13-trimethyl-7-azapentacyclo[10.8.0.0^{2,9}.0^{5,9}.0^{13,18}]icos-18-en-16-yl]pentanamide | Conessine analogue, 13d
Type:
Small organic molecule
Emp. Form.:
C31H51N3O2
Mol. Mass.:
497.7555
SMILES:
[H][C@@]1(C)N(C)C[C@]23CC[C@@]4([H])[C@@]([H])(CC=C5C[C@H](CC[C@]45C)N(C)C(=O)[C@H](CC(C)C)NC(C)=O)[C@]2([H])CC[C@]13[H]
:
Substrate
Name:
BDBM22530
Synonyms:
N(alpha)-Methylhistamine N-methylhistamine [2-(1H-imidazol-5-yl)ethyl](methyl)amine | [3H]N-alpha-methyl histamine
Type:
radiolabeled ligand
Emp. Form.:
C6H11N3
Mol. Mass.:
125.1716
SMILES:
CNCCc1cnc[nH]1
: