Target
Cell division cycle 7-related protein kinase [58-574]/Protein DBF4 homolog A
Ligand
BDBM27362
Substrate
MCM2
Meas. Tech.
In Vitro Kinase Assay
pH
7.9±n/a
Temperature
298.15±n/a K
IC50
2±1 nM
Citation
 Menichincheri, MBargiotti, ABerthelsen, JBertrand, JABossi, RCiavolella, ACirla, ACristiani, CCroci, VD'Alessio, RFasolini, MFiorentini, FForte, BIsacchi, AMartina, KMolinari, AMontagnoli, AOrsini, POrzi, FPesenti, EPezzetta, DPillan, APoggesi, IRoletto, FScolaro, ATatò, MTibolla, MValsasina, BVarasi, MVolpi, DSantocanale, CVanotti, E First Cdc7 kinase inhibitors: pyrrolopyridinones as potent and orally active antitumor agents. 2. Lead discovery. J Med Chem 52:293-307 (2009)  
Target
Name:
Cell division cycle 7-related protein kinase [58-574]/Protein DBF4 homolog A
Synonyms:
Cdc7 Kinase | Cdc7/DBF4
Type:
Protein Complex
Mol. Mass.:
Description:
Components:
This complex has 2 components.
Component 1
Name:
Cell division cycle 7-related protein kinase [58-574]
Synonyms:
CDC7 CDC7_HUMAN Cell division cycle 7-related protein kinase
Type:
Serine/threonine-protein kinase
Mol. Mass.:
57470.88
Organism:
Homo sapiens (Human)
Description:
O00311[58-574]
Residue:
517
  
Component 2
Name:
Protein DBF4 homolog A
Synonyms:
ASK Chiffon homolog A DBF4-type zinc finger-containing protein 1 DBF4A_HUMAN ZDBF1
Type:
Regulatory subunit
Mol. Mass.:
76869.65
Organism:
Homo sapiens (Human)
Description:
Residue:
674
  
Inhibitor
Name:
BDBM27362
Synonyms:
7-(2-fluoroethyl)-2-(pyridin-4-yl)-1H,4H,5H,6H,7H-pyrrolo[3,2-c]pyridin-4-one | Pyrrolopyridinone, 81
Type:
Small organic molecule
Emp. Form.:
C14H14FN3O
Mol. Mass.:
259.2789
SMILES:
FCCC1CNC(=O)c2cc([nH]c12)-c1ccncc1
:
Substrate
Name:
MCM2
Synonyms:
BM28 CDCL1 KIAA0030 MCM2_HUMAN Nuclear protein BM28
Type:
Other Protein Type
Mol. Mass.:
32619.37
Organism:
Homo sapiens (Human)
Description:
P49736[10-294]
Residue:
285