Target
Inhibitor of nuclear factor kappa-B kinase subunit alpha
Ligand
BDBM27475
Substrate
I-kappa-B-alpha
Meas. Tech.
IKK Kinase Inhibition Assay
pH
7.4±n/a
Temperature
295.15±n/a K
IC50
3162±n/a nM
Citation
 Christopher, JAAvitabile, BGBamborough, PChampigny, ACCutler, GJDyos, SLGrace, KGKerns, JKKitson, JDMellor, GWMorey, JVMorse, MAO'Malley, CFPatel, CBProbst, NRumsey, WSmith, CAWilson, MJ The discovery of 2-amino-3,5-diarylbenzamide inhibitors of IKK-alpha and IKK-beta kinases. Bioorg Med Chem Lett 17:3972-7 (2007)  
Target
Name:
Inhibitor of nuclear factor kappa-B kinase subunit alpha
Synonyms:
CHUK I-kappa-B kinase 1 IKK-A IKK1 IKKA IkBKA Inhibitor of NF-kappa-B kinase alpha/beta Nuclear factor NF-kappa-B inhibitor kinase alpha TCF16 | Transcription factor 16
Type:
PROTEIN
Mol. Mass.:
84642.21
Organism:
Homo sapiens (Human)
Description:
ChEMBL_327453
Residue:
745
  
Inhibitor
Name:
BDBM27475
Synonyms:
2-amino-3-phenyl-5-(pyridin-4-yl)benzamide | Amino-substituted diarylbenzamide, 8p
Type:
Small organic molecule
Emp. Form.:
C18H15N3O
Mol. Mass.:
289.3312
SMILES:
NC(=O)c1cc(cc(-c2ccccc2)c1N)-c1ccncc1
:
Substrate
Name:
NF-kappa-B inhibitor alpha
Synonyms:
I-kappa-B-alpha IKBA_HUMAN NF-kappa-B inhibitor alpha NFKBIA
Type:
GST fusion protein
Mol. Mass.:
35584.84
Organism:
Homo sapiens (Human)
Description:
It was produced in E. coli as GST-tagged fusion protein (Santa Cruz Biotechnology).
Residue:
317