Target
Inhibitor of nuclear factor kappa-B kinase subunit epsilon
Ligand
BDBM27475
Substrate
I-kappa-B-alpha
Meas. Tech.
IKK Kinase Inhibition Assay
IC50
3981±n/a nM
Citation
 Christopher, JAAvitabile, BGBamborough, PChampigny, ACCutler, GJDyos, SLGrace, KGKerns, JKKitson, JDMellor, GWMorey, JVMorse, MAO'Malley, CFPatel, CBProbst, NRumsey, WSmith, CAWilson, MJ The discovery of 2-amino-3,5-diarylbenzamide inhibitors of IKK-alpha and IKK-beta kinases. Bioorg Med Chem Lett 17:3972-7 (2007)  
Target
Name:
Inhibitor of nuclear factor kappa-B kinase subunit epsilon
Synonyms:
I kappa-B kinase epsilon I-kappa-B kinase epsilon (IKK-E) IKBKE IKK-epsilon IKKE IKKI KIAA0151 | von Hippel-Lindau disease tumor suppressor/Inhibitor of nuclear factor kappa-B kinase subunit epsilon
Type:
Serine/threonine-protein kinase
Mol. Mass.:
80475.98
Organism:
Homo sapiens (Human)
Description:
Kinase inhibitory activity was determined using recombinant human IKK-epsilon expressed in baculovirus as a FLAG-tagged fusion protein.
Residue:
716
  
Inhibitor
Name:
BDBM27475
Synonyms:
2-amino-3-phenyl-5-(pyridin-4-yl)benzamide | Amino-substituted diarylbenzamide, 8p
Type:
Small organic molecule
Emp. Form.:
C18H15N3O
Mol. Mass.:
289.3312
SMILES:
NC(=O)c1cc(cc(-c2ccccc2)c1N)-c1ccncc1
:
Substrate
Name:
NF-kappa-B inhibitor alpha
Synonyms:
I-kappa-B-alpha IKBA_HUMAN NF-kappa-B inhibitor alpha NFKBIA
Type:
GST fusion protein
Mol. Mass.:
35584.84
Organism:
Homo sapiens (Human)
Description:
It was produced in E. coli as GST-tagged fusion protein (Santa Cruz Biotechnology).
Residue:
317