Target
Poly [ADP-ribose] polymerase 1
Ligand
BDBM27540
Substrate
BDBM27089
Meas. Tech.
PARP-1 Enzyme Assay
pH
7.4±n/a
Temperature
295.15±n/a K
IC50
12±n/a nM
Citation
 Menear, KAAdcock, CBoulter, RCockcroft, XLCopsey, LCranston, ADillon, KJDrzewiecki, JGarman, SGomez, SJavaid, HKerrigan, FKnights, CLau, ALoh, VMMatthews, ITMoore, SO'Connor, MJSmith, GCMartin, NM 4-[3-(4-cyclopropanecarbonylpiperazine-1-carbonyl)-4-fluorobenzyl]-2H-phthalazin-1-one: a novel bioavailable inhibitor of poly(ADP-ribose) polymerase-1. J Med Chem 51:6581-91 (2008)  
Target
Name:
Poly [ADP-ribose] polymerase 1
Synonyms:
(ARTD1 or PARP1) 2.4.2.30 ADPRT ARTD1 Human diphtheria toxin-like ADP-ribosyltransferase (ARTD1 or PARP1) NT-PARP-1 PARP1 PPOL Poly [ADP-ribose] polymerase 1 (PARP) Poly [ADP-ribose] polymerase 1 (PARP1) Poly [ADP-ribose] polymerase 1, 28-kDa form Poly [ADP-ribose] polymerase 1, processed C-terminus Poly [ADP-ribose] polymerase-1 Poly(ADP-ribose) polymerase-1 (ARTD1/PARP1) Protein poly-ADP-ribosyltransferase PARP1 | Synonyms=ADPRT
Type:
Mol. Mass.:
113114.22
Organism:
Homo sapiens (Human)
Description:
P09874
Residue:
1014
  
Inhibitor
Name:
BDBM27540
Synonyms:
4-({3-[(4-acetyl-1,4-diazepan-1-yl)carbonyl]-4-fluorophenyl}methyl)-1,2-dihydrophthalazin-1-one | Homopiperazine analogue, 21
Type:
Small organic molecule
Emp. Form.:
C23H23FN4O3
Mol. Mass.:
422.4521
SMILES:
CC(=O)N1CCCN(CC1)C(=O)c1cc(Cc2n[nH]c(=O)c3ccccc23)ccc1F
:
Substrate
Name:
BDBM27089
Synonyms:
[3H] Nicotinamide adenine dinucleotide biotinylated NAD+
Type:
radiolabeled substrate
Emp. Form.:
C21H28N7O14P2
Mol. Mass.:
664.4325
SMILES:
NC(=O)c1ccc[n+](c1)[C@H]1O[C@@H](COP(O)(=O)OP(O)(=O)OC[C@H]2O[C@H]([C@H](O)[C@@H]2O)n2cnc3c(N)ncnc23)[C@H](O)[C@@H]1O
: