Target
Poly [ADP-ribose] polymerase 1
Ligand
BDBM27542
Substrate
BDBM27089
Meas. Tech.
PARP-1 Enzyme Assay
pH
7.4±n/a
Temperature
295.15±n/a K
IC50
2±n/a nM
Citation
 Menear, KAAdcock, CAlonso, FCBlackburn, KCopsey, LDrzewiecki, JFundo, ALe Gall, AGomez, SJavaid, HLence, CFMartin, NMMydlowski, CSmith, GC Novel alkoxybenzamide inhibitors of poly(ADP-ribose) polymerase. Bioorg Med Chem Lett 18:3942-5 (2008)  
Target
Name:
Poly [ADP-ribose] polymerase 1
Synonyms:
(ARTD1 or PARP1) 2.4.2.30 ADPRT ARTD1 Human diphtheria toxin-like ADP-ribosyltransferase (ARTD1 or PARP1) NT-PARP-1 PARP1 PPOL Poly [ADP-ribose] polymerase 1 (PARP) Poly [ADP-ribose] polymerase 1 (PARP1) Poly [ADP-ribose] polymerase 1, 28-kDa form Poly [ADP-ribose] polymerase 1, processed C-terminus Poly [ADP-ribose] polymerase-1 Poly(ADP-ribose) polymerase-1 (ARTD1/PARP1) Protein poly-ADP-ribosyltransferase PARP1 | Synonyms=ADPRT
Type:
Mol. Mass.:
113114.22
Organism:
Homo sapiens (Human)
Description:
P09874
Residue:
1014
  
Inhibitor
Name:
BDBM27542
Synonyms:
4-(3-(piperazine-1-carbonyl)benzyl)phthalazin-1(2H)-one 4-{[3-(piperazin-1-ylcarbonyl)phenyl]methyl}-1,2-dihydrophthalazin-1-one CHEMBL201616 | Piperazine analogue, 23
Type:
Small organic molecule
Emp. Form.:
C20H20N4O2
Mol. Mass.:
348.3984
SMILES:
O=C(N1CCNCC1)c1cccc(Cc2n[nH]c(=O)c3ccccc23)c1
:
Substrate
Name:
BDBM27089
Synonyms:
[3H] Nicotinamide adenine dinucleotide biotinylated NAD+
Type:
radiolabeled substrate
Emp. Form.:
C21H28N7O14P2
Mol. Mass.:
664.4325
SMILES:
NC(=O)c1ccc[n+](c1)[C@H]1O[C@@H](COP(O)(=O)OP(O)(=O)OC[C@H]2O[C@H]([C@H](O)[C@@H]2O)n2cnc3c(N)ncnc23)[C@H](O)[C@@H]1O
: