Target
Poly [ADP-ribose] polymerase 1
Ligand
BDBM27703
Substrate
BDBM27683
Meas. Tech.
PARP-1 Enzyme Inhibition Assay
pH
8±n/a
Temperature
296.15±n/a K
IC50
9720±n/a nM
Citation
 Moree, WJGoldman, PDemaggio, AJChristenson, EHerendeen, DEksterowicz, JKesicki, EAMcElligott, DLBeaton, G Identification of ring-fused pyrazolo pyridin-2-ones as novel poly(ADP-ribose)polymerase-1 inhibitors. Bioorg Med Chem Lett 18:5126-9 (2008)  
Target
Name:
Poly [ADP-ribose] polymerase 1
Synonyms:
(ARTD1 or PARP1) 2.4.2.30 ADPRT ARTD1 Human diphtheria toxin-like ADP-ribosyltransferase (ARTD1 or PARP1) NT-PARP-1 PARP1 PPOL Poly [ADP-ribose] polymerase 1 (PARP) Poly [ADP-ribose] polymerase 1 (PARP1) Poly [ADP-ribose] polymerase 1, 28-kDa form Poly [ADP-ribose] polymerase 1, processed C-terminus Poly [ADP-ribose] polymerase-1 Poly(ADP-ribose) polymerase-1 (ARTD1/PARP1) Protein poly-ADP-ribosyltransferase PARP1 | Synonyms=ADPRT
Type:
Mol. Mass.:
113114.22
Organism:
Homo sapiens (Human)
Description:
P09874
Residue:
1014
  
Inhibitor
Name:
BDBM27703
Synonyms:
3-methyl-5-phenyl-4,5,7-triazatricyclo[7.4.0.0^{2,6}]trideca-1(9),2(6),3-trien-8-one | ring-fused pyrazolo pyridin-2-one, 30
Type:
Small organic molecule
Emp. Form.:
C17H17N3O
Mol. Mass.:
279.3364
SMILES:
Cc1nn(-c2ccccc2)c2[nH]c(=O)c3CCCCc3c12
:
Substrate
Name:
BDBM27683
Synonyms:
[adenylate-32P]-NAD
Type:
radiolabeled substrate
Emp. Form.:
Mol. Mass.:
SMILES:
: