Target
Tyrosine-protein kinase JAK2
Ligand
BDBM391013
Substrate
Meas. Tech.
Biochemical HTRF Assay
IC50
0.050±n/a nM
Citation
 Childers, MLFuller, PGuerin, DKatz, JDPu, QScott, METhompson, CFMartinez, MFalcone, DTorres, LDeng, YKurukulasuriya, RZeng, HBai, YKong, NLiu, YZheng, Z Geminally substituted cyanoethylpyrazolo pyridones as Janus kinase inhibitors US Patent  US9957264 Publication Date 5/1/2018 
Target
Name:
Tyrosine-protein kinase JAK2
Synonyms:
JAK-2 JAK2_HUMAN Janus kinase 2 (JAK2) | Janus kinase 2 (a protein tyrosine kinase)
Type:
Protein
Mol. Mass.:
130684.68
Organism:
Homo sapiens (Human)
Description:
O60674
Residue:
1132
  
Inhibitor
Name:
BDBM391013
Synonyms:
4-({1-[(1R,2R))-1- (cyanomethyl)-2- fluorocyclohexyl]-4-oxo- 4,5-dihydro-1H-pyrazolo [4,3-c]pyridin-3-yl} amino)-N,N- dimethylbenzene- sulfonamide (from I-19A) US9957264, Example 5-84
Type:
Small organic molecule
Emp. Form.:
C22H25FN6O3S
Mol. Mass.:
472.536
SMILES:
CN(C)S(=O)(=O)c1ccc(Nc2nn(c3cc[nH]c(=O)c23)[C@@]2(CC#N)CCCC[C@H]2F)cc1
: