Target
Insulin-like growth factor 1 receptor
Ligand
BDBM27888
Substrate
poly (Glu/Tyr)
Meas. Tech.
IGF-1R Inhibition Assay
pH
7±n/a
Temperature
303.15±n/a K
IC50
34±n/a nM
Citation
 Velaparthi, UWittman, MLiu, PCarboni, JMLee, FYAttar, RBalimane, PClarke, WSinz, MWHurlburt, WPatel, KDiscenza, LKim, SGottardis, MGreer, ALi, ASaulnier, MYang, ZZimmermann, KTrainor, GVyas, D Discovery and evaluation of 4-(2-(4-chloro-1H-pyrazol-1-yl)ethylamino)-3-(6-(1-(3-fluoropropyl)piperidin-4-yl)-4-methyl-1H-benzo[d]imidazol-2-yl)pyridin-2(1H)-one (BMS-695735), an orally efficacious inhibitor of insulin-like growth factor-1 receptor kinase with broad spectrum in vivo antitumor acti J Med Chem 51:5897-900 (2008)  
Target
Name:
Insulin-like growth factor 1 receptor
Synonyms:
CD_antigen=CD221 IGF1R Insulin-like growth factor 1 receptor (IGF1R) Insulin-like growth factor 1 receptor alpha chain Insulin-like growth factor I receptor | Insulin-like growth factor receptor (IGFR)
Type:
Protein
Mol. Mass.:
154776.79
Organism:
Homo sapiens (Human)
Description:
P08069
Residue:
1367
  
Inhibitor
Name:
BDBM27888
Synonyms:
4-{[2-(4-chloro-1H-pyrazol-1-yl)ethyl]amino}-3-{6-[1-(3-fluoropropyl)piperidin-4-yl]-4-methyl-1H-1,3-benzodiazol-2-yl}-1,2-dihydropyridin-2-one | BMS-695735
Type:
Small organic molecule
Emp. Form.:
C26H31ClFN7O
Mol. Mass.:
512.022
SMILES:
Cc1cc(cc2[nH]c(nc12)-c1c(NCCn2cc(Cl)cn2)cc[nH]c1=O)C1CCN(CCCF)CC1
:
Substrate
Name:
poly (Glu/Tyr)
Synonyms:
Type:
Random copolymer
Mol. Mass.:
358.43
Organism:
Description:
Residue:
3
NA