Target
Insulin-like growth factor 1 receptor
Ligand
BDBM28046
Substrate
Biotinylated substrate peptide
Meas. Tech.
In Vitro Kinase Inhibition Assay
pH
7.5±n/a
Temperature
295.15±n/a K
IC50
2420±n/a nM
Citation
 Mayer, SCBanker, ALBoschelli, FDi, LJohnson, MKenny, CHKrishnamurthy, GKutterer, KMoy, FPetusky, SRavi, MTkach, DTsou, HRXu, W Lead identification to generate isoquinolinedione inhibitors of insulin-like growth factor receptor (IGF-1R) for potential use in cancer treatment. Bioorg Med Chem Lett 18:3641-5 (2008)  
Target
Name:
Insulin-like growth factor 1 receptor
Synonyms:
CD_antigen=CD221 IGF1R Insulin-like growth factor 1 receptor (IGF1R) Insulin-like growth factor 1 receptor alpha chain Insulin-like growth factor I receptor | Insulin-like growth factor receptor (IGFR)
Type:
Protein
Mol. Mass.:
154776.79
Organism:
Homo sapiens (Human)
Description:
P08069
Residue:
1367
  
Inhibitor
Name:
BDBM28046
Synonyms:
(4Z)-6-bromo-4-({[4-(pyrrolidin-1-ylmethyl)phenyl]amino}methylidene)-1,2,3,4-tetrahydroisoquinoline-1,3-dione | isoquinolinedione, 1
Type:
Small organic molecule
Emp. Form.:
C21H20BrN3O2
Mol. Mass.:
426.306
SMILES:
Brc1ccc2C(=O)NC(=O)C(=CNc3ccc(CN4CCCC4)cc3)c2c1
:
Substrate
Name:
Biotinylated substrate peptide
Synonyms:
Type:
Peptide
Mol. Mass.:
2453.64
Organism:
Description:
Residue:
19
ITINNHTRDIYETDYYRKH