Target
Epidermal growth factor receptor [T790M]
Ligand
BDBM149404
Substrate
Meas. Tech.
Assay on In Vitro Enzyme-Inhibiting Activity
IC50
2500±n/a nM
Citation
 Wu, F Tyrosine kinase inhibitor and uses thereof US Patent  US10300058 Publication Date 5/28/2019 
Target
Name:
Epidermal growth factor receptor [T790M]
Synonyms:
EGFR ERBB Epidermal growth factor receptor (EGFR) T790M Epidermal growth factor receptor (EGFR)(T790M) HER1
Type:
Enzyme
Mol. Mass.:
134309.68
Organism:
Homo sapiens (Human)
Description:
P00533 (T790M)
Residue:
1210
  
Inhibitor
Name:
BDBM149404
Synonyms:
AVL-301 CNX-419 Rociletinib US10167264, Compound CO-1686 US10434101, Compound I-4 US8975249, I-4 | US9783524, CO-1686
Type:
Small organic molecule
Emp. Form.:
C27H28F3N7O3
Mol. Mass.:
555.5515
SMILES:
COc1cc(ccc1Nc1ncc(c(Nc2cccc(NC(=O)C=C)c2)n1)C(F)(F)F)N1CCN(CC1)C(C)=O
: