Target
Steroidogenic factor 1
Ligand
BDBM28648
Substrate
BDBM10852
Meas. Tech.
Transactivation Cell-Based Assay
EC50
200±110 nM
Citation
 Roth, JMadoux, FHodder, PRoush, WR Synthesis of small molecule inhibitors of the orphan nuclear receptor steroidogenic factor-1 (NR5A1) based on isoquinolinone scaffolds. Bioorg Med Chem Lett 18:2628-32 (2008)  
Target
Name:
Steroidogenic factor 1
Synonyms:
AD4BP FTZF1 NR5A1 SF-1 STF-1 Steroid hormone receptor Ad4BP
Type:
Nuclear Hormone Receptor
Mol. Mass.:
51643.43
Organism:
Homo sapiens (Human)
Description:
Residue:
461
  
Inhibitor
Name:
BDBM28648
Synonyms:
ethyl 2-{[1-oxo-2-({[4-(trifluoromethoxy)phenyl]carbamoyl}methyl)-1,2-dihydroisoquinolin-5-yl]oxy}propanoate | isoquinolinone scaffold, 32
Type:
Small organic molecule
Emp. Form.:
C23H21F3N2O6
Mol. Mass.:
478.4178
SMILES:
CCOC(=O)C(C)Oc1cccc2c1ccn(CC(=O)Nc1ccc(OC(F)(F)F)cc1)c2=O
:
Substrate