Target
Peroxisome proliferator-activated receptor gamma
Ligand
BDBM28718
Substrate
BDBM10852
Meas. Tech.
Cell-Based Transcription Assay
EC50
>25000±n/a nM
Citation
 Sierra, MLBeneton, VBoullay, ABBoyer, TBrewster, AGDonche, FForest, MCFouchet, MHGellibert, FJGrillot, DALambert, MHLaroze, ALe Grumelec, CLinget, JMMontana, VGNguyen, VLNicodème, EPatel, VPenfornis, APineau, OPohin, DPotvain, FPoulain, GRuault, CBSaunders, MToum, JXu, HEXu, RXPianetti, PM Substituted 2-[(4-aminomethyl)phenoxy]-2-methylpropionic acid PPARalpha agonists. 1. Discovery of a novel series of potent HDLc raising agents. J Med Chem 50:685-95 (2007)  
Target
Name:
Peroxisome proliferator-activated receptor gamma
Synonyms:
NR1C3 PPAR-gamma PPARG_HUMAN Peroxisome proliferator-activated receptor gamma (PPAR gamma) Peroxisome proliferator-activated receptor gamma (PPARĪ³) peroxisome proliferator-activated receptor gamma isoform 2
Type:
Nuclear Receptor
Mol. Mass.:
57613.46
Organism:
Homo sapiens (Human)
Description:
P37231
Residue:
505
  
Inhibitor
Name:
BDBM28718
Synonyms:
2-methyl-2-phenoxypropanoic acid, 25j | 2-methyl-2-{4-[({4-methyl-2-[2-(trifluoromethyl)phenyl]-1,3-thiazol-5-yl}formamido)methyl]phenoxy}propanoic acid
Type:
Small organic molecule
Emp. Form.:
C23H21F3N2O4S
Mol. Mass.:
478.484
SMILES:
Cc1nc(sc1C(=O)NCc1ccc(OC(C)(C)C(O)=O)cc1)-c1ccccc1C(F)(F)F
:
Substrate