Target
Dihydroorotate dehydrogenase (quinone), mitochondrial
Ligand
BDBM29036
Substrate
BDBM14700
Meas. Tech.
DHODH Inhibition Assay
Ki
25±n/a nM
IC50
200±n/a nM
Citation
 Davies, MHeikkilä, TMcConkey, GAFishwick, CWParsons, MRJohnson, AP Structure-based design, synthesis, and characterization of inhibitors of human and Plasmodium falciparum dihydroorotate dehydrogenases. J Med Chem 52:2683-93 (2009)  
Target
Name:
Dihydroorotate dehydrogenase (quinone), mitochondrial
Synonyms:
DHODH Dihydroorotate dehydrogenase Dihydroorotate dehydrogenase, mitochondrial Dihydroorotate oxidase (DHODH) | PYRD_HUMAN
Type:
Enzyme
Mol. Mass.:
42881.33
Organism:
Homo sapiens (Human)
Description:
Q02127
Residue:
395
  
Inhibitor
Name:
BDBM29036
Synonyms:
cyanohydroxybutenamide, 26
Type:
Small organic molecule
Emp. Form.:
C17H12Cl2N2O2
Mol. Mass.:
347.195
SMILES:
CC(=O)C(C#N)C(=O)Nc1ccc(cc1)-c1cccc(Cl)c1Cl
:
Substrate
Name:
BDBM14700
Synonyms:
2,3-dimethoxy-5-methyl-6-decyl-1,4-benzoquinone Decylubiquinone
Type:
Ubiquinone analog
Emp. Form.:
C19H30O4
Mol. Mass.:
322.4391
SMILES:
CCCCCCCCC=Cc1c(C)c(O)c(OC)c(OC)c1O
: