Target
Ribosyldihydronicotinamide dehydrogenase [quinone]
Ligand
BDBM29223
Substrate
BDBM29211
Meas. Tech.
QR2 Assay and IC50 Value Determination
pH
7.5±n/a
Temperature
296.15±n/a K
IC50
4100±600 nM
Citation
 Maiti, AReddy, PVSturdy, MMarler, LPegan, SDMesecar, ADPezzuto, JMCushman, M Synthesis of casimiroin and optimization of its quinone reductase 2 and aromatase inhibitory activities. J Med Chem 52:1873-84 (2009)  
Target
Name:
Ribosyldihydronicotinamide dehydrogenase [quinone]
Synonyms:
Metallothionein-3 NQO2 NRH dehydrogenase [quinone] 2 QR2 Quinone reductase 2 (NQO2) | Ribosyldihydronicotinamide dehydrogenase [quinone]
Type:
Protein
Mol. Mass.:
25917.25
Organism:
Homo sapiens (Human)
Description:
P16083
Residue:
231
  
Inhibitor
Name:
BDBM29223
Synonyms:
casimiroin analogue, 1l
Type:
Small organic molecule
Emp. Form.:
C13H15NO3
Mol. Mass.:
233.2631
SMILES:
COc1ccc(OC)c2n(C)c(=O)cc(C)c12
:
Substrate
Name:
BDBM29211
Synonyms:
N-methyldihydronicotinamide | NMeH
Type:
Small organic molecule
Emp. Form.:
C18H16N5S
Mol. Mass.:
334.418
SMILES:
Cc1nc(sc1C)-[n+]1nc(nn1-c1ccccc1)-c1ccccc1
: