Target
Nitric oxide synthase, endothelial
Ligand
BDBM22030
Substrate
BDBM21959
Meas. Tech.
NOS Enzyme Inhibition Assay
pH
7.5±n/a
Temperature
303.15±n/a K
Ki
107000±n/a nM
Citation
 Igarashi, JLi, HJamal, JJi, HFang, JLawton, GRSilverman, RBPoulos, TL Crystal structures of constitutive nitric oxide synthases in complex with de novo designed inhibitors. J Med Chem 52:2060-6 (2009)  
Target
Name:
Nitric oxide synthase, endothelial
Synonyms:
Constitutive NOS Endothelial nitric oxide synthase NOS type III NOS3_BOVIN Nitric-oxide synthase, endothelial | cNOS
Type:
Enzyme
Mol. Mass.:
133292.26
Organism:
Bos taurus (bovine)
Description:
Recombinant eNOS overexpressed in E. coli was used in enzyme assays.
Residue:
1205
  
Inhibitor
Name:
BDBM22030
Synonyms:
(2S)-2-amino-N-[(1S)-3-amino-1-(aminocarbonyl)propyl]-5-{[(E)-imino(nitroamino)methyl]amino}pentanamide (2S)-2-amino-N-[(1S)-3-amino-1-(aminocarbonyl)propyl]-5-{[imino(nitroamino)methyl]amino}pentanamide CHEMBL1204421 CHEMBL481413 L-Arg NO2-L-Dbu-NH2 L-Nomega-nitroarginine-2,4-L-diaminobutyramide | dipeptide amide inhibitor I
Type:
Small organic molecule
Emp. Form.:
C10H22N8O4
Mol. Mass.:
318.3329
SMILES:
NCC[C@H](NC(=O)[C@@H](N)CCCN=C(N)N[N+]([O-])=O)C(N)=O
:
Substrate
Name:
BDBM21959
Synonyms:
(2S)-2-amino-5-carbamimidamidopentanoic acid CHEMBL1485 | L-arginine
Type:
Amino Acid
Emp. Form.:
C6H14N4O2
Mol. Mass.:
174.201
SMILES:
[#7]-[#6@@H](-[#6]-[#6]-[#6]\[#7]=[#6](/[#7])-[#7])-[#6](-[#8])=O
: