Target
Nitric oxide synthase, inducible
Ligand
BDBM29264
Substrate
BDBM10852
Meas. Tech.
Cell-Based NOS Transient Transfection Assay
Temperature
298.15±n/a K
EC50
87±20 nM
Comments
extracted
Citation
 Bonnefous, CPayne, JERoppe, JZhuang, HChen, XSymons, KTNguyen, PMSablad, MRozenkrants, NZhang, YWang, LSeverance, DWalsh, JPYazdani, NShiau, AKNoble, SARix, PRao, TSHassig, CASmith, ND Discovery of inducible nitric oxide synthase (iNOS) inhibitor development candidate KD7332, part 1: Identification of a novel, potent, and selective series of quinolinone iNOS dimerization inhibitors that are orally active in rodent pain models. J Med Chem 52:3047-62 (2009)  
Target
Name:
Nitric oxide synthase, inducible
Synonyms:
HEP-NOS Inducible NO synthase NOS type II NOS2A Nitric oxide synthase, inducible (iNOS) | iNOS
Type:
Homodimer
Mol. Mass.:
131141.95
Organism:
Homo sapiens (Human)
Description:
P35228
Residue:
1153
  
Inhibitor
Name:
BDBM29264
Synonyms:
isoquinoline N-oxide, 34
Type:
Small organic molecule
Emp. Form.:
C21H15ClFN3O2S
Mol. Mass.:
427.879
SMILES:
Cc1ncsc1C(=O)N(Cc1c[n+]([O-])cc2c(F)cccc12)c1cccc(Cl)c1
:
Substrate