Target
Nitric oxide synthase, endothelial
Ligand
BDBM29274
Substrate
BDBM10852
Meas. Tech.
Cell-Based NOS Transient Transfection Assay
Temperature
298.15±n/a K
EC50
35000±n/a nM
Comments
extracted
Citation
 Bonnefous, CPayne, JERoppe, JZhuang, HChen, XSymons, KTNguyen, PMSablad, MRozenkrants, NZhang, YWang, LSeverance, DWalsh, JPYazdani, NShiau, AKNoble, SARix, PRao, TSHassig, CASmith, ND Discovery of inducible nitric oxide synthase (iNOS) inhibitor development candidate KD7332, part 1: Identification of a novel, potent, and selective series of quinolinone iNOS dimerization inhibitors that are orally active in rodent pain models. J Med Chem 52:3047-62 (2009)  
Target
Name:
Nitric oxide synthase, endothelial
Synonyms:
Constitutive NOS Endothelial NOS NOS type III NOS3_HUMAN Nitric oxide synthase (inducible and endothelial) Nitric-oxide synthase (endothelial and brain) eNOS
Type:
Enzyme Catalytic Domain
Mol. Mass.:
133297.84
Organism:
Homo sapiens (Human)
Description:
P29474
Residue:
1203
  
Inhibitor
Name:
BDBM29274
Synonyms:
quinolinone, 44
Type:
Small organic molecule
Emp. Form.:
C21H14ClF2N3O2S
Mol. Mass.:
445.87
SMILES:
Cc1ncsc1C(=O)N(Cc1c(F)c(=O)[nH]c2c(F)cccc12)c1cccc(Cl)c1
:
Substrate