Target
Beta-carbonic anhydrase 1
Ligand
BDBM10889
Substrate
BDBM10856
Meas. Tech.
CA Inhibition Assay
Ki
2300±n/a nM
Citation
 Minakuchi, TNishimori, IVullo, DScozzafava, ASupuran, CT Molecular cloning, characterization, and inhibition studies of the Rv1284 beta-carbonic anhydrase from Mycobacterium tuberculosis with sulfonamides and a sulfamate. J Med Chem 52:2226-32 (2009)  
Target
Name:
Beta-carbonic anhydrase 1
Synonyms:
β-Carbonic anhydrase 1 (CA 1) MTCA1_MYCTU canA | mtcA1
Type:
Enzyme
Mol. Mass.:
18186.06
Organism:
Mycobacterium tuberculosis
Description:
The recombinant GST-mtCA1 construct was cloned, expressed, and further purified from E. coli. The purified protein was used in inhibition assays.
Residue:
163
  
Inhibitor
Name:
BDBM10889
Synonyms:
2-methoxy-N-[(1-methylpyrrolidin-2-yl)methyl]-5-sulfamoylbenzamide Sulpiride (SLP)
Type:
Small organic molecule
Emp. Form.:
C14H21N3O4S
Mol. Mass.:
327.399
SMILES:
COc1ccc(cc1C(=O)NCC1CCCN1C)S(N)(=O)=O
:
Substrate
Name:
BDBM10856
Synonyms:
Carbon Dioxide | methanedione
Type:
Small organic molecule
Emp. Form.:
CO2
Mol. Mass.:
44.0095
SMILES:
O=C=O
: