Target
Potassium-transporting ATPase alpha chain 1
Ligand
BDBM394389
Substrate
Meas. Tech.
Proton Potassium-adenosine Triphosphatase (H+,K+-ATPase) Inhibitory Activity
IC50
13.0±n/a nM
Citation
 Kajino, MHasuoka, ATarui, NTakagi, T Proton pump inhibitors US Patent  US10308605 Publication Date 6/4/2019 
Target
Name:
Potassium-transporting ATPase alpha chain 1
Synonyms:
ATP4A Gastric H(+)/K(+) ATPase subunit alpha Na/K-ATPase Potassium-transporting ATPase alpha chain 1 | Proton pump
Type:
Enzyme
Mol. Mass.:
114279.23
Organism:
Sus scrofa (Pig)
Description:
P19156
Residue:
1034
  
Inhibitor
Name:
BDBM394389
Synonyms:
Ethyl 1-(pyridazin-3-ylsulfonyl)-5-phenyl-1H-pyrrole-3-carboxylate | US10308605, Example 157
Type:
Small organic molecule
Emp. Form.:
C18H17N3O4S
Mol. Mass.:
371.41
SMILES:
CCOC(=O)c1cc(-c2cccc(C)c2)n(c1)S(=O)(=O)c1cccnn1
: