Target
Ribosyldihydronicotinamide dehydrogenase [quinone]
Ligand
BDBM29611
Substrate
BDBM29211
Meas. Tech.
QR2 Inhibition Assay
pH
8±n/a
Temperature
298.15±n/a K
IC50
1100±200 nM
Citation
 Calamini, BSantarsiero, BDBoutin, JAMesecar, AD Kinetic, thermodynamic and X-ray structural insights into the interaction of melatonin and analogues with quinone reductase 2. Biochem J 413:81-91 (2008)  
Target
Name:
Ribosyldihydronicotinamide dehydrogenase [quinone]
Synonyms:
Metallothionein-3 NQO2 NRH dehydrogenase [quinone] 2 QR2 Quinone reductase 2 (NQO2) | Ribosyldihydronicotinamide dehydrogenase [quinone]
Type:
Protein
Mol. Mass.:
25917.25
Organism:
Homo sapiens (Human)
Description:
P16083
Residue:
231
  
Inhibitor
Name:
BDBM29611
Synonyms:
2-Iodomelatonin Melatonin,2-Iodo
Type:
Small organic molecule
Emp. Form.:
C13H15IN2O2
Mol. Mass.:
358.1749
SMILES:
COc1ccc2[nH]c(I)c(CCNC(C)=O)c2c1
:
Substrate
Name:
BDBM29211
Synonyms:
N-methyldihydronicotinamide | NMeH
Type:
Small organic molecule
Emp. Form.:
C18H16N5S
Mol. Mass.:
334.418
SMILES:
Cc1nc(sc1C)-[n+]1nc(nn1-c1ccccc1)-c1ccccc1
: