Target
Runt-related transcription factor 1
Ligand
BDBM29639
Substrate
Venus-CBFbeta-SMMHC
Meas. Tech.
Identification of compounds inhibiting the binding between the RUNX1 Runt domain and CBFbeta-SMMHC via a time resolved fluorescence resonance energy transfer (TR-FRET) assay.
pH
7.4±n/a
Temperature
296.15±n/a K
IC50
7080±n/a nM
Citation
 PubChem, PC Identification of compounds inhibiting the binding between the RUNX1 Runt domain and CBFb-SMMHC via a time resolved fluorescence resonance energy transfer (TR-FRET) assay. PubChem Bioassay (2009)[AID] 
Target
Name:
Runt-related transcription factor 1
Synonyms:
AML1 CBF-alpha-2 Core-binding factor subunit alpha-2 Polyomavirus enhancer-binding protein 2 alpha B subunit RUNX1_HUMAN | Runt-Related Transcription Factor 1 Isoform AML1C
Type:
Subunit of heterodimeric transcription factor
Mol. Mass.:
48750.25
Organism:
Homo sapiens (Human)
Description:
Q01196
Residue:
453
  
Inhibitor
Name:
BDBM29639
Synonyms:
(4E)-3-methyl-4-[[3-[(2-methyl-4-oxidanyl-phenyl)amino]-1,4-dihydroquinoxalin-2-yl]imino]cyclohexa-2,5-dien-1-one (4E)-4-[[3-(4-hydroxy-2-methylanilino)-1,4-dihydroquinoxalin-2-yl]imino]-3-methyl-1-cyclohexa-2,5-dienone MLS000105899 cid_9601081
Type:
Small organic molecule
Emp. Form.:
C22H20N4O2
Mol. Mass.:
372.4198
SMILES:
Cc1cc(O)ccc1Nc1nc2ccccc2nc1Nc1ccc(O)cc1C
:
Substrate
Name:
Core-binding factor subunit beta isoform 2
Synonyms:
CBFB PEBB_HUMAN Venus-core-binding factor subunit beta-smooth muscle myosin heavy chain
Type:
Fluorescent fusion protein
Mol. Mass.:
21988.19
Organism:
Homo sapiens (Human)
Description:
Q13951-2
Residue:
187