Target
Runt-related transcription factor 1
Ligand
BDBM29665
Substrate
Venus-CBFbeta-SMMHC
Meas. Tech.
Identification of compounds inhibiting the binding between the RUNX1 Runt domain and CBFbeta-SMMHC via a time resolved fluorescence resonance energy transfer (TR-FRET) assay.
pH
7.4±n/a
Temperature
296.15±n/a K
IC50
13000±n/a nM
Citation
 PubChem, PC Identification of compounds inhibiting the binding between the RUNX1 Runt domain and CBFb-SMMHC via a time resolved fluorescence resonance energy transfer (TR-FRET) assay. PubChem Bioassay (2009)[AID] 
Target
Name:
Runt-related transcription factor 1
Synonyms:
AML1 CBF-alpha-2 Core-binding factor subunit alpha-2 Polyomavirus enhancer-binding protein 2 alpha B subunit RUNX1_HUMAN | Runt-Related Transcription Factor 1 Isoform AML1C
Type:
Subunit of heterodimeric transcription factor
Mol. Mass.:
48750.25
Organism:
Homo sapiens (Human)
Description:
Q01196
Residue:
453
  
Inhibitor
Name:
BDBM29665
Synonyms:
(9-Oxo-9H-acridin-10-yl)-acetic acid (2,5-dimethyl-1-p-tolyl-1H-pyrrol-3-ylmethylene)-hydrazide N-[[2,5-dimethyl-1-(4-methylphenyl)-3-pyrrolyl]methylideneamino]-2-(9-oxo-10-acridinyl)acetamide N-[[2,5-dimethyl-1-(4-methylphenyl)pyrrol-3-yl]methylideneamino]-2-(9-oxoacridin-10-yl)acetamide SMR000175922 | cid_3116773
Type:
Small organic molecule
Emp. Form.:
C29H26N4O2
Mol. Mass.:
462.5423
SMILES:
Cc1cc(C=NNC(=O)Cn2c3ccccc3c(=O)c3ccccc23)c(C)n1-c1ccc(C)cc1
:
Substrate
Name:
Core-binding factor subunit beta isoform 2
Synonyms:
CBFB PEBB_HUMAN Venus-core-binding factor subunit beta-smooth muscle myosin heavy chain
Type:
Fluorescent fusion protein
Mol. Mass.:
21988.19
Organism:
Homo sapiens (Human)
Description:
Q13951-2
Residue:
187