Target
Runt-related transcription factor 1
Ligand
BDBM29672
Substrate
Venus-CBFbeta-SMMHC
Meas. Tech.
Identification of compounds inhibiting the binding between the RUNX1 Runt domain and CBFbeta-SMMHC via a time resolved fluorescence resonance energy transfer (TR-FRET) assay.
pH
7.4±n/a
Temperature
296.15±n/a K
IC50
7940±n/a nM
Citation
 PubChem, PC Identification of compounds inhibiting the binding between the RUNX1 Runt domain and CBFb-SMMHC via a time resolved fluorescence resonance energy transfer (TR-FRET) assay. PubChem Bioassay (2009)[AID] 
Target
Name:
Runt-related transcription factor 1
Synonyms:
AML1 CBF-alpha-2 Core-binding factor subunit alpha-2 Polyomavirus enhancer-binding protein 2 alpha B subunit RUNX1_HUMAN | Runt-Related Transcription Factor 1 Isoform AML1C
Type:
Subunit of heterodimeric transcription factor
Mol. Mass.:
48750.25
Organism:
Homo sapiens (Human)
Description:
Q01196
Residue:
453
  
Inhibitor
Name:
BDBM29672
Synonyms:
5-(2-keto-7-methoxy-4-propionyloxy-6-propyl-chromen-3-yl)furan-2-carboxylic acid ethyl ester 5-[7-methoxy-2-oxo-4-(1-oxopropoxy)-6-propyl-1-benzopyran-3-yl]-2-furancarboxylic acid ethyl ester SMR000217534 ethyl 5-(7-methoxy-2-oxidanylidene-4-propanoyloxy-6-propyl-chromen-3-yl)furan-2-carboxylate | ethyl 5-(7-methoxy-2-oxo-4-propanoyloxy-6-propylchromen-3-yl)furan-2-carboxylate
Type:
Small organic molecule
Emp. Form.:
C23H24O8
Mol. Mass.:
428.4319
SMILES:
CCCc1cc2c(OC(=O)CC)c(-c3ccc(o3)C(=O)OCC)c(=O)oc2cc1OC
:
Substrate
Name:
Core-binding factor subunit beta isoform 2
Synonyms:
CBFB PEBB_HUMAN Venus-core-binding factor subunit beta-smooth muscle myosin heavy chain
Type:
Fluorescent fusion protein
Mol. Mass.:
21988.19
Organism:
Homo sapiens (Human)
Description:
Q13951-2
Residue:
187