Target
Runt-related transcription factor 1
Ligand
BDBM29692
Substrate
Venus-CBFbeta-SMMHC
Meas. Tech.
Identification of compounds inhibiting the binding between the RUNX1 Runt domain and CBFbeta-SMMHC via a time resolved fluorescence resonance energy transfer (TR-FRET) assay.
pH
7.4±n/a
Temperature
296.15±n/a K
IC50
100000±n/a nM
Citation
 PubChem, PC Identification of compounds inhibiting the binding between the RUNX1 Runt domain and CBFb-SMMHC via a time resolved fluorescence resonance energy transfer (TR-FRET) assay. PubChem Bioassay (2009)[AID] 
Target
Name:
Runt-related transcription factor 1
Synonyms:
AML1 CBF-alpha-2 Core-binding factor subunit alpha-2 Polyomavirus enhancer-binding protein 2 alpha B subunit RUNX1_HUMAN | Runt-Related Transcription Factor 1 Isoform AML1C
Type:
Subunit of heterodimeric transcription factor
Mol. Mass.:
48750.25
Organism:
Homo sapiens (Human)
Description:
Q01196
Residue:
453
  
Inhibitor
Name:
BDBM29692
Synonyms:
(2Z)-3-ethyl-2-[(E)-3-(3-ethyl-4,5-dihydro-1,3-thiazol-3-ium-2-yl)prop-2-enylidene]-1,3-thiazolidine;iodide 3-ethyl-2-[(E,3E)-3-(3-ethylthiazolidin-2-ylidene)prop-1-enyl]-2-thiazolin-3-ium;iodide MLS000764534 cid_6504365
Type:
Small organic molecule
Emp. Form.:
C13H21N2S2
Mol. Mass.:
269.449
SMILES:
CCN1CCS\C1=C/C=C/C1=[N+](CC)CCS1
:
Substrate
Name:
Core-binding factor subunit beta isoform 2
Synonyms:
CBFB PEBB_HUMAN Venus-core-binding factor subunit beta-smooth muscle myosin heavy chain
Type:
Fluorescent fusion protein
Mol. Mass.:
21988.19
Organism:
Homo sapiens (Human)
Description:
Q13951-2
Residue:
187