Target
Beta-secretase 2
Ligand
BDBM29777
Substrate
Fluorescent Substrate
Meas. Tech.
Enzyme Inhibition Assay
IC50
28±n/a nM
Citation
 Charrier, NClarke, BCutler, LDemont, EDingwall, CDunsdon, RHawkins, JHowes, CHubbard, JHussain, IMaile, GMatico, RMosley, JNaylor, AO'Brien, ARedshaw, SRowland, PSoleil, VSmith, KJSweitzer, STheobald, PVesey, DWalter, DSWayne, G Second generation of BACE-1 inhibitors part 3: Towards non hydroxyethylamine transition state mimetics. Bioorg Med Chem Lett 19:3674-8 (2009)  
Target
Name:
Beta-secretase 2
Synonyms:
AEPLC ASP1 Asp 1 Aspartyl protease 1 BACE2_HUMAN Beta-secretase (BACE) Beta-secretase 2 (BACE-2) Beta-site APP-cleaving enzyme 2 Memapsin-1 beta-Secretase (BACE-2)
Type:
Protein
Mol. Mass.:
56171.20
Organism:
Homo sapiens (Human)
Description:
Q9Y5Z0
Residue:
518
  
Inhibitor
Name:
BDBM29777
Synonyms:
7,6,5 tricyclic sulfonamide, 15 | BMCL193674 Compound 8
Type:
Small organic molecule
Emp. Form.:
C27H33F3N4O4S
Mol. Mass.:
566.636
SMILES:
CCc1cn2CCS(=O)(=O)N(C)c3cc(cc1c23)C(=O)N[C@@H](Cc1ccccc1)[C@H](O)CNCCC(F)(F)F
:
Substrate
Name:
Fluorescent Substrate
Synonyms:
Type:
Peptide
Mol. Mass.:
2030.30
Organism:
Description:
Residue:
18
FAMSEVNLDAEFKTAMRA