Target
Nociceptin receptor
Ligand
BDBM29975
Substrate
BDBM29961
Meas. Tech.
Radioligand Binding Assay
pH
7.4±n/a
Temperature
310.15±n/a K
IC50
67±n/a nM
Citation
 Kobayashi, KUchiyama, MIto, HTakahashi, HYoshizumi, TSakoh, HNagatomi, YAsai, MMiyazoe, HTsujita, THirayama, MOzaki, STani, TIshii, YOhta, HOkamoto, O Discovery of novel arylpyrazole series as potent and selective opioid receptor-like 1 (ORL1) antagonists. Bioorg Med Chem Lett 19:3627-31 (2009)  
Target
Name:
Nociceptin receptor
Synonyms:
KOR-3 Mu-type opioid receptor (Mu) Nociceptin Receptor (ORL1 Receptor) Nociceptin receptor (ORL-1) Nociceptin/Orphanin FQ, NOP receptor OPIATE ORL-1 OPRL1 protein ORL1 Opioid receptor like-1 Orphanin FQ receptor (ORL1) | P41146
Type:
G Protein-Coupled Receptor (GPCR)
Mol. Mass.:
40702.87
Organism:
Homo sapiens (Human)
Description:
P41146
Residue:
370
  
Inhibitor
Name:
BDBM29975
Synonyms:
arylpyrazole, 20
Type:
Small organic molecule
Emp. Form.:
C22H26ClN5
Mol. Mass.:
395.928
SMILES:
CCc1ccc(cn1)-c1c(C)c(CNC2CCCC2)nn1-c1ncccc1Cl
:
Substrate
Name:
BDBM29961
Synonyms:
[125I]Tyr14-NC/OFQ | [125I]Tyr14-Nociceptin
Type:
radiolabeled substrate
Emp. Form.:
Mol. Mass.:
SMILES:
: