Target
Sodium-dependent noradrenaline transporter
Ligand
BDBM30132
Substrate
BDBM22166
Meas. Tech.
PDE4 Enzyme Assay
Ki
10600±n/a nM
EC50
1930±n/a nM
Citation
 Cashman, JRVoelker, TZhang, HTO'Donnell, JM Dual inhibitors of phosphodiesterase-4 and serotonin reuptake. J Med Chem 52:1530-9 (2009)  
Target
Name:
Sodium-dependent noradrenaline transporter
Synonyms:
Monoamine transporter NET Noradrenaline Transporter (NET) Norepinephrine transporter protein (NET) SLC6A2 Sodium-dependent noradrenaline transporter (NET) | Solute carrier family 6 member 2
Type:
Multi-pass membrane protein
Mol. Mass.:
69337.72
Organism:
Homo sapiens (Human)
Description:
P23975
Residue:
617
  
Inhibitor
Name:
BDBM30132
Synonyms:
CHEMBL450907 | tetrahydrofuranyl ethylamine, 15
Type:
Small organic molecule
Emp. Form.:
C16H24FNO2
Mol. Mass.:
281.3657
SMILES:
COc1ccc(F)cc1CCCC1CCC(CCN)O1
:
Substrate
Name:
BDBM22166
Synonyms:
3-(4-iodophenyl)tropane-2-carboxylic acid methyl ester CHEMBL215376 RTI-258 [125I]RTI-55 | methyl (1R,2S,3S,5S)-3-(4-iodophenyl)-8-methyl-8-azabicyclo[3.2.1]octane-2-carboxylate
Type:
radiolabeled ligand
Emp. Form.:
C16H20INO2
Mol. Mass.:
385.24
SMILES:
[H][C@]12CC[C@]([H])([C@H]([C@H](C1)c1ccc(I)cc1)C(=O)OC)N2C
: