Target
Collagenase 3
Ligand
BDBM30383
Substrate
MMP-13 Substrate
Meas. Tech.
Determination of MMP-13 Activity
Temperature
298.15±n/a K
IC50
0.5±n/a nM
Comments
extracted
Citation
 Monovich, LGTommasi, RAFujimoto, RABlancuzzi, VClark, KCornell, WDDoti, RDoughty, JFang, JFarley, DFitt, JGanu, VGoldberg, RGoldstein, RLavoie, SKulathila, RMacchia, WParker, DTMelton, RO'Byrne, EPastor, GPellas, TQuadros, EReel, NRoland, DMSakane, YSingh, HSkiles, JSomers, JToscano, KWigg, AZhou, SZhu, LShieh, WCXue, SMcQuire, LW Discovery of potent, selective, and orally active carboxylic acid based inhibitors of matrix metalloproteinase-13. J Med Chem 52:3523-38 (2009)  
Target
Name:
Collagenase 3
Synonyms:
MMP-13 MMP13_HUMAN Matrix metalloproteinase-13 (MMP-13) | Matrix metalloproteinase-13 (MMP13)
Type:
Enzyme
Mol. Mass.:
53808.06
Organism:
Homo sapiens (Human)
Description:
P45452
Residue:
471
  
Inhibitor
Name:
BDBM30383
Synonyms:
piperidinyl glycine derivative, 24t
Type:
Small organic molecule
Emp. Form.:
C25H32N2O7S2
Mol. Mass.:
536.661
SMILES:
CCOc1ccc(cc1)-c1ccc(s1)S(=O)(=O)N[C@H](C1CCN(CC1)C(=O)OC1CCCC1)C(O)=O
:
Substrate
Name:
MMP-13 Substrate
Synonyms:
Type:
Fluorogenic Substrate
Mol. Mass.:
2571.45
Organism:
Description:
Residue:
24