Target
Receptor-type tyrosine-protein kinase FLT3 [D835H]
Ligand
BDBM31090
Substrate
biotinylated affinity ligand
Meas. Tech.
Kinase Inhibitor Selectivity Profiling Assay
pH
7.4±n/a
Temperature
298.15±n/a K
Kd
3300±n/a nM
Citation
 PubChem, PC Kinase Inhibitor Selectivity Profiling Assay PubChem Bioassay (2008)[AID] 
Target
Name:
Receptor-type tyrosine-protein kinase FLT3 [D835H]
Synonyms:
CD135 FLK2 FLT3(D835H) Receptor-type tyrosine-protein kinase FLT3 (D835H) STK1 Tyrosine Kinase FLT3 Mutant (D835H)
Type:
Mol. Mass.:
112912.18
Organism:
Homo sapiens (Human)
Description:
P36888 D835H
Residue:
993
  
Inhibitor
Name:
BDBM31090
Synonyms:
(E)-N-[4-(3-chloro-4-fluoro-anilino)-3-cyano-7-ethoxy-6-quinolyl]-4-(dimethylamino)but-2-enamide (E)-N-[4-(3-chloro-4-fluoroanilino)-3-cyano-7-ethoxyquinolin-6-yl]-4-(dimethylamino)but-2-enamide EKB-569 cid_6445562
Type:
Small organic molecule
Emp. Form.:
C24H23ClFN5O2
Mol. Mass.:
467.923
SMILES:
CCOc1cc2ncc(C#N)c(Nc3ccc(F)c(Cl)c3)c2cc1NC(=O)\C=C\CN(C)C
:
Substrate
Name:
biotinylated affinity ligand
Synonyms:
Type:
Mol. Mass.:
358.43
Organism:
Description:
Residue:
3
NA