Target
Receptor-type tyrosine-protein kinase FLT3 [D835Y]
Ligand
BDBM5931
Substrate
biotinylated affinity ligand
Meas. Tech.
Kinase Inhibitor Selectivity Profiling Assay
pH
7.4±n/a
Temperature
298.15±n/a K
Kd
3000±n/a nM
Citation
 PubChem, PC Kinase Inhibitor Selectivity Profiling Assay PubChem Bioassay (2008)[AID] 
Target
Name:
Receptor-type tyrosine-protein kinase FLT3 [D835Y]
Synonyms:
CD135 FLK2 FLT3(D835Y) Receptor-type tyrosine-protein kinase FLT3 (D835Y) STK1 Tyrosine Kinase FLT3 Mutant (D835Y)
Type:
Mol. Mass.:
112937.71
Organism:
Homo sapiens (Human)
Description:
P36888 D835Y
Residue:
993
  
Inhibitor
Name:
BDBM5931
Synonyms:
BMS-387072 N-(5-{[(5-tert-butyl-1,3-oxazol-2-yl)methyl]sulfanyl}-1,3-thiazol-2-yl)piperidine-4-carboxamide cid_3025986
Type:
Small organic molecule
Emp. Form.:
C17H24N4O2S2
Mol. Mass.:
380.528
SMILES:
CC(C)(C)c1cnc(CSc2cnc(NC(=O)C3CCNCC3)s2)o1
:
Substrate
Name:
biotinylated affinity ligand
Synonyms:
Type:
Mol. Mass.:
358.43
Organism:
Description:
Residue:
3
NA