Target
Receptor-type tyrosine-protein kinase FLT3 [D835Y]
Ligand
BDBM31099
Substrate
biotinylated affinity ligand
Meas. Tech.
Kinase Inhibitor Selectivity Profiling Assay
pH
7.4±n/a
Temperature
298.15±n/a K
Kd
3200±n/a nM
Citation
 PubChem, PC Kinase Inhibitor Selectivity Profiling Assay PubChem Bioassay (2008)[AID] 
Target
Name:
Receptor-type tyrosine-protein kinase FLT3 [D835Y]
Synonyms:
CD135 FLK2 FLT3(D835Y) Receptor-type tyrosine-protein kinase FLT3 (D835Y) STK1 Tyrosine Kinase FLT3 Mutant (D835Y)
Type:
Mol. Mass.:
112937.71
Organism:
Homo sapiens (Human)
Description:
P36888 D835Y
Residue:
993
  
Inhibitor
Name:
BDBM31099
Synonyms:
2-(2-chlorophenyl)-5,7-dihydroxy-8-[(3S)-3-hydroxy-1-methyl-4-piperidinyl]-1-benzopyran-4-one 2-(2-chlorophenyl)-5,7-dihydroxy-8-[(3S)-3-hydroxy-1-methylpiperidin-4-yl]chromen-4-one CHEMBL45741 cid_24867231
Type:
Small organic molecule
Emp. Form.:
C21H20ClNO5
Mol. Mass.:
401.84
SMILES:
CN1CCC([C@H](O)C1)c1c(O)cc(O)c2c1oc(cc2=O)-c1ccccc1Cl
:
Substrate
Name:
biotinylated affinity ligand
Synonyms:
Type:
Mol. Mass.:
358.43
Organism:
Description:
Residue:
3
NA